{"text_format":"1","workbook":"xlsx","n_sheets":4,"sheets":["Instrukcja merytoryczna","Informacje nt Ankiety","Instrukcja techniczna","Dane"],"not_rendered":{"charts":0,"images":1,"macros":1,"external_links":0,"defined_names":4,"comments":1,"pivot_tables":0},"unopened":[],"bounds":{"document_bytes":16777216,"sheet_cells":100000,"rows_first":2000,"rows_last":500,"rows_between":2000,"halvings":0,"cell_chars":16384,"cell_head_chars":4096},"cells_cut":0,"cells_raw":0,"read":"whole","date_system":"1900"}

{"sheet":"Instrukcja merytoryczna","index":0,"n_rows":30,"n_cols":2,"rows_kept":30,"cut":false,"hidden":false,"merged":[]}
[]
[null,"Przejdź do formularza Ankiety"]
[]
[null,"Wyjaśnienia dodatkowe dotyczące zwartości merytorycznej ankiety"]
[]
[null,"W OBU ANKIETACH (finansowanie udzielone i otrzymane) należy raportować WSZYSTKIE transakcje zawarte w celu finansowania działalności w podziale na kategorie wymienione w ankiecie. Między ankietami nie powinno być różnic w zakresie raportowanych danych."]
[]
[null,"Celem prowadzonego badania jest zebranie informacji nt. przepływów finansowych służących FINANSOWANIU DZIAŁALNOŚCI między Bankami/Oddziałami a podmiotami powiązanymi. Dlatego to po stronie Banku/Oddziału leży decyzja, czy daną transakcję można uznać jako formę finansowania działalności."]
[]
[null,"Bilans"]
[null,"BL - tylko lokaty i kredyt"]
[null,"BP - wszystkie inne instrumenty bilansowe,  które bank stosuje do finansowania działalności"]
[]
[null,"Pozabilans"]
[null,"PL - tylko linie kredytowe"]
[null,"PG - tylko gwarancje"]
[null,"PT - wszystkie instrumenty pozabilansowe (w tym pochodne), wykorzystane do finansowania działalności"]
[]
[null,"W celu unifikacji danych prosimy o ich przekazywanie: "]
[]
[null,"według terminów zapadalności"]
[null,"według wartości nominalnej."]
[null,"w obu plikach maja być podane wszystkie transakcje pozabilansowe, które służą finansowaniu bez ograniczania ich rodzajów"]
[null,"nie należy w tabeli ujmować sald rachunków nostro"]
[null,"należy ująć lokaty jednodniowe oraz O/N"]
[]
[null,"Dodatkowo wyjaśniamy, że:"]
[]
[null,"a) w przypadku Banku - w kolumnie 9 w arkuszu dane należy zaznaczyć \"T\" gdy transakcja dotyczy podmiotu pierwotnie dominującego - inaczej \"matki\""]
[null,"b) w przypadku Oddziału Instytucji Kredytowej - W kolumnie 9 w arkuszu dane należy zaznaczyć \"T\" gdy transakcja dotyczy podmiotu pierwotnie dominującego wobec jednostki, do której należy Oddział"]
{"$rows_left_out":1}
{"sheet":"Informacje nt Ankiety","index":1,"n_rows":86,"n_cols":2,"rows_kept":86,"cut":false,"hidden":false,"merged":[]}
[]
[null,"Przejdź do formularza Ankiety"]
[]
[null,"Informacje ogólne"]
[]
[null,"Informację dotyczącą finansowania OTRZYMANEGO należy przekazywać miesięcznie:"]
[]
[null,"zarówno w przypadku Banku jak też Oddziału Instytucji Kredytowej:"]
[null,"za ostatni dzień roboczy danego miesiąca (w terminie 5 dni roboczych)"]
[]
[null,"Formularz obowiązuje od 1 lutego 2014 r. (pierwsza wysyłka do UKNF do 5 marca 2014 r."]
[]
[null,"Zakres danych w porównaniu z poprzednim cyklem ankiety nie uległ zmianie, w związku ze zmianą częstotliwości przekazywania plików do UKNF zaistniała konieczność dodania dodatkowej kolumny (DataTMP) rozróżniającej daty rekordów."]
[null,"Przy okazji formularz został rozbudowany o liczne algorytmy kontrolne oraz szczegółowe instrukcje mające na celu wyeliminowanie błędów powtarzających się na etapie wypełniania sprawozdania przez Banki / Oddziały"]
[]
[null,"Kolorystyka arkusza Dane"]
[]
[null,"Pola żółte oznaczają ważne wskazówki techniczne, których przestrzeganie zapewni poprawne wypełnienie formularza."]
[]
[null,"Pola zielone (kolor tła tej komórki) pozostają do wypełnienia przez Bank / Oddział"]
[null,"Jeżeli zielone pole mimo wypełnienia nie zmieni koloru na jasny żółty (kolor tła tej komórki) będzie to sygnalizować błąd"]
[]
[null,"Pola czerwone (kolor tła tej komórki) sygnalizują błędy - szczegóły błędów można sprawdzić w obszarach właściwych algorytmów kontrolnych"]
[]
[null,"Poprawnie wypełnione pole zmienia kolor na jasny żółty (kolor tła tej komórki)"]
[]
[null,"Wskazówki jak wypełnić formularz"]
[]
[null,"W celu poprawnego wypełnienia arkusza Dane należy OBLIGATORYJNIE wypełnić 3 pola:"]
[null,"Komórka G4 - wybrać z listy rozwijanej właściwy bank - system nie akceptuje wpisów spoza listy"]
{"$rows_left_out":57}
{"sheet":"Instrukcja techniczna","index":2,"n_rows":53,"n_cols":2,"rows_kept":53,"cut":false,"hidden":false,"merged":[]}
[]
[null,"Przejdź do formularza Ankiety"]
[]
[null,"Informacja na temat poprawnego przeklejania bloku danych"]
[]
[null,"1. Zaznaczony blok danych w pliku źródłowym kopiujemy do bufora (menu kopiuj lub Ctrl + C)"]
[null,"2. W formularzu UKNF ustawiamy się w komórce do której będziemy wklejać dane"]
[null,"3. Wybieramy opcję Wklej specjalnie (z menu lub kombinacją klawiszy Ctrl + Alt + V)"]
[]
[null,"UWAGA !!!"]
[null,"Wklejanie bloku danych za pomocą funkcji Wklej (Ctrl + V) spowoduje nadpisanie formatów nałożonych przez UKNF oraz może wyłączyć działanie niektórych algorytmów kontrolnych, co ograniczy szansę na automatyczne wychwytywanie błędów powstałych w trakcie wypełniania formularza przez Bank / Oddział"]
[]
[null,"4. Pojawi się okno dialogowe które parametryzujemy jak na rysunku poniżej i wybieramy OK."]
[]
[]
[]
[]
[]
[]
[]
[]
[]
[]
[]
[]
[]
[]
[]
[]
[]
{"$rows_left_out":24}
{"sheet":"Dane","index":3,"n_rows":500,"n_cols":57,"rows_kept":500,"cut":false,"hidden":false,"merged":[[0,18,1,18],[0,16,1,16],[0,17,1,17]]}
["Finansowanie OTRZYMANE podmiotom powiązanym",null,null,null,null,null,null,null,null,null,null,null,null,null,"formularz obowiązuje od 1 lutego 2014 r.",null,"Numer kolumny","Nazwa","Ile rekordów wypełnił bank",null,null,null,"Algorytmy kontrolne kolumn",null,null,null,null,"Finansowanie","O",null,null,"Znak przejściowy","_",null,null,null,"Data","Matka","Sektor","Ekspozycja","Zapadalność","Waluta"]
["Kontakt z Bankiem / Oddziałem",null,null,null,null,null,"Wybierz Bank / Oddział oraz data raportu z listy",null,null,null,"Nazwa pliku do UKNF",null,null,"Tabela przestawna",null,null,null,null,null,null,null,null,"Najmniejsza liczba rekordów w kolumnach 7-15",null,null,null,null,"Wybrany kod banku",{"$f":"IF(S14=\"Błąd\",\"x\",VALUE(LEFT(Dane!$G$4,4)))","v":"x"},null,null,null,null,null,null,"Data min",{"$f":"IF($AC$15=\"x\",\"Wybierz datę\",IF($AC$14=\"O\",$AC$17,AG7))","v":"Wybierz datę"},"T","F","BL",1,"EUR"]
[null,null,"Imię i nazwisko","telefon",null,null,"Wybierz Bank / Oddział","Rok","Miesiąc",null,"Nazwa pliku dla UKNF",null,null,null,null,null,"Kolumna 7","NazwaPodmiotu",{"$f":"COUNTA(G22:G500)","v":0},null,null,null,{"$f":"MIN(S3:$S$11)","v":0},null,null,null,null,"Nazwa wybranego banku",{"$f":"IF(S14=\"Błąd\",\"x\",VLOOKUP(AC2,$AE$23:$AF$80,2,FALSE))","v":"x"},null,null,"Nr Wiersza nagłówka TP",{"$f":"ROW(A21)","v":21},null,null,"Data max",{"$f":"IF($AC$15=\"x\",\"Wybierz datę\",IF($AC$14=\"O\",$AC$17,AG8))","v":"Wybierz datę"},"N","N","BP",2,"USD"]
["Sporządził",null,null,null,null,null,null,null,null,null,{"$f":"IF(AC12=\"x\",\"Błąd w obszarze G4:I4\",AC12)","v":"Błąd w obszarze G4:I4"},null,null,null,null,null,"Kolumna 8","Regon/EKZ",{"$f":"COUNTA(H22:H500)","v":0},null,null,null,"Największa liczba rekordów w kolumnach 7-15",null,null,null,null,"Data Rok",{"$f":"IF(S15=\"Błąd\",\"x\",Dane!H4)","v":"x"},null,null,"Wiersz pierwszej linii wpisu",{"$f":"$AG$3+1","v":22},null,null,null,null,null,null,"PL",3,"CHF"]
["Zatwierdził",null,null,null,null,null,null,null,null,null,null,null,null,null,null,null,"Kolumna 9","CzyMatka",{"$f":"COUNTA(I22:I500)","v":0},null,null,null,{"$f":"MAX(S3:$S$11)","v":0},null,null,null,null,"Data Miesiąc nazwa",{"$f":"IF(S16=\"Błąd\",\"x\",Dane!I4)","v":"x"},null,null,"Wiersz ostatniej linii wpisu",{"$f":"$AG$3+W5","v":21},null,null,null,null,null,null,"PG",4,"PLN"]
[null,null,"Kontakt UKNF",null,null,null,"Informacje nt. Ankiety","Inf. techniczne",null,"Inf. merytoryczne","Zapisywanie pliku",null,null,"Tabela przestawna",null,null,"Kolumna 10","Sektor",{"$f":"COUNTA(J22:J500)","v":0},null,null,null,"Rozbieżności w liczbie rekordów w kolumnach",null,null,null,null,"Data Miesiąc liczba",{"$f":"IF($S$16=\"Błąd\",\"x\",VLOOKUP(AC5,$AJ$6:$AK$17,2,FALSE))","v":"x"},null,null,null,null,null,null,"styczeń",1,"01",null,"PT",5,"Inna"]
[null,null,null,null,null,null,null,null,null,null,null,null,null,null,null,null,"Kolumna 11","Ekspozycja",{"$f":"COUNTA(K22:K500)","v":0},null,null,null,{"$f":"IF(W3<>W5,\"TAK\",\"NIE\")","v":"NIE"},null,null,null,null,"Data Miesiąc tekst",{"$f":"IF($S$16=\"Błąd\",\"x\",VLOOKUP(AC6,$AK$6:$AL$17,2,FALSE))","v":"x"},null,null,null,{"$f":"IF($AC$15=\"x\",\"Wybierz datę\",DATE(AC4,AC6,1))","v":"Wybierz datę"},null,null,"luty",2,"02",null,null,6]
["Obszar algorytmów kontrolnych - czerwone pola oznaczają błędy lub braki danych",null,null,null,null,null,null,null,null,null,null,null,null,null,null,null,"Kolumna 12","Zapadalność",{"$f":"COUNTA(L22:L500)","v":0},null,null,null,null,null,null,null,null,null,null,null,null,null,{"$f":"IF($AC$15=\"x\",\"Wybierz datę\",DATE(AC4,AC6+1,0))","v":"Wybierz datę"},null,null,"marzec",3,"03",null,null,7]
["Kontrola danych kontaktowych",null,null,null,null,"Kontrola wyboru Banku / Oddziału i daty raportu",null,null,null,"Kontrola ilości danych w kolumnach",null,null,{"$f":"\"Czy było finansowanie - \" & UPPER(I4)","v":"Czy było finansowanie - "},null,null,null,"Kolumna 13","Waluta",{"$f":"COUNTA(M22:M500)","v":0},null,null,null,null,null,null,null,null,"Nazwa pliku - Data",{"$f":"AC4 & AG1 & AC7","v":"x_x"},null,null,null,null,null,null,"kwiecień",4,"04",null,null,8]
[{"$f":"IF(COUNTA($C$4:$D$5)<4,\"Niekompletne dane kontaktowe-zakres C4:D5\",\"OK\")","v":"Niekompletne dane kontaktowe-zakres C4:D5"},null,null,null,null,{"$f":"IF(OR(S14=\"Błąd\",S15=\"Błąd\",S16=\"Błąd\"),\"Wybierz Bank / Oddział  i datę raportu  - zakres G4:I4\",\"OK\")","v":"Wybierz Bank / Oddział  i datę raportu  - zakres G4:I4"},null,null,null,{"$f":"IF(W7=\"TAK\",W6,\"OK\")","v":"OK"},null,null,{"$f":"IF(F10=\"OK\",IF($W$5>0,\"TAK\",\"NIE   - brak danych\"),\"Uzupełnij  zakres G4:I4\")","v":"Uzupełnij  zakres G4:I4"},null,null,null,"Kolumna 14","Kwota",{"$f":"COUNTA(N22:N500)","v":0},null,null,null,null,null,null,null,null,"Nazwa pliku - Data + Fin",{"$f":"IF(AC9=\"x\",\"x\", AC1 &AG1 & AC9)","v":"O_x_x"},null,null,null,null,null,null,"maj",5,"05"]
[null,null,"Idź do obszaru kontaktów",null,null,null,"Idź do obszaru wyboru Banku i daty",null,null,"Idź do algorytmów kontrolnych",null,null,null,"Brak finansowania",null,null,"Kolumna 15","DataTMP",{"$f":"COUNTA(O22:O500)","v":0},null,null,null,null,null,null,null,null,"Nazwa pliku - Bank",{"$f":"IF(AC2=\"x\",\"x\", AG1 & AC2)","v":"x"},null,null,2014,null,null,null,"czerwiec",6,"06"]
[null,null,null,null,null,null,null,null,null,null,null,null,null,null,null,null,null,null,null,null,null,null,null,null,null,null,null,"NAZWA PLIKU",{"$f":"IF(OR(AC2=\"x\",AC4=\"x\",AC5=\"x\"),\"x\", AC10 &AC11 & \".xlsm\")","v":"x"},null,null,2015,null,null,null,"lipiec",7,"07"]
[{"$f":"\"Liczba świąt:  \" & UPPER(I4)","v":"Liczba świąt:  "},null,null,{"$f":"\"Brak dat:  \" & UPPER(I4)","v":"Brak dat:  "},null,null,{"$f":"G21","v":"NazwaPodmiotu"},"Regon/EKZ","CzyMatka","Sektor","Ekspozycja","Zapadalność","Waluta","Kwota","DataTMP",null,"Kontrola wyboru podmiotu i daty",null,null,null,null,null,null,null,null,null,null,null,null,null,null,2016,null,null,null,"sierpień",8,"08"]
[{"$f":"COUNTIF(S26:S56,$S$62)","v":0},null,null,{"$f":"T63","v":0},null,null,{"$f":"X24","v":0},{"$f":"X33","v":0},{"$f":"X40","v":0},{"$f":"X46","v":0},{"$f":"X52","v":0},{"$f":"X60","v":0},{"$f":"X66","v":0},{"$f":"X72","v":0},{"$f":"T69","v":0},null,"Bank/Oddział",{"$f":"IF(ISNA(VLOOKUP(G4,Dane!$AG$23:$AG$80,1,FALSE)),\"Wybierz Bank\",VLOOKUP(G4,Dane!$AG$23:$AG$80,1,FALSE))","v":"Wybierz Bank"},{"$f":"IF(LEFT(R14,7)=\"Wybierz\",\"Błąd\",\"Poprawnie\")","v":"Błąd"},null,null,null,null,null,null,null,null,"Bank czy Oddział","O",null,null,2017,null,null,null,"wrzesień",9,"09",null,"2000-01-01",{"$f":"TEXT(AN14,\"dddd\")","v":"sobota"}]
["Pomoc",null,"Aktualizuj","Pokaż","Pomoc",null,"Pokaż błędy","Pokaż błędy","Pokaż błędy","Pokaż błędy","Pokaż błędy","Pokaż błędy","Pokaż błędy","Pokaż błędy","Pokaż błędy",null,"Rok",{"$f":"IF(ISNA(VLOOKUP(H4,Dane!$AF$11:$AF$17,1,FALSE)),\"Wybierz Rok\",VLOOKUP(H4,Dane!$AF$11:$AF$17,1,FALSE))","v":"Wybierz Rok"},{"$f":"IF(LEFT(R15,7)=\"Wybierz\",\"Błąd\",\"Poprawnie\")","v":"Błąd"},null,null,null,null,null,null,null,null,"DataOK",{"$f":"IF(AND(AC4<>\"x\",AC6<>\"x\"),\"OK\",\"x\")","v":"x"},null,null,2018,null,null,null,"październik",10,"10",null,"2000-01-02",{"$f":"TEXT(AN15,\"dddd\")","v":"niedziela"}]
[null,null,null,null,null,null,null,null,null,null,null,null,null,null,null,null,"Miesiąc",{"$f":"IF(ISNA(VLOOKUP(I4,Dane!$AJ$6:$AJ$17,1,FALSE)),\"Wybierz miesiąc\",VLOOKUP(I4,Dane!$AJ$6:$AJ$17,1,FALSE))","v":"Wybierz miesiąc"},{"$f":"IF(LEFT(R16,7)=\"Wybierz\",\"Błąd\",\"Poprawnie\")","v":"Błąd"},null,null,null,null,null,null,null,null,null,null,null,null,2019,null,null,null,"listopad",11,"11"]
["WAŻNE - W przypadku wklejania bloku danych należy wkleić WARTOŚCI (opcja wklej specjalnie lub Ctrl + Alt +V -> Wartości) w celu zachowania formatów oraz algorytmów kontrolnych",null,null,null,null,null,null,null,null,null,null,null,null,null,null,null,null,null,null,null,null,null,null,null,null,null,null,"Ostatni dzień roboczy",{"$f":"MAX(BE26:BE56)","v":"00:00:00"},null,null,2020,null,null,null,"grudzień",12,"12"]
["Po poprawnym przeklejeniu prawidłowych wartości kolor wypełnianych komórek powinien się zmienić na jasno żółty:",null,null,null,null,null,null,null,null,null,"Jeżeli kolor jest inny przejdź do instrukcji",null,null,"Jak kopiować"]
["Finansowanie","Kod Banku/Oddziału","Nazwa Banku","Data","Rezydent /\nNierezydent","Kod kraju","Nazwa podmiotu z którym dokonano transakcji","Regon/EKZ","Czy finansowanie zostało OTRZYMANE od podmiotu dominującego","Sektor\nF-podmiot sektora finansowego\nN-podmiot sektora niefinansowego","Ekspozycje bilansowe\nBL - Lokaty i kredyty otrzymane\nBP - Pozostałe zobowiązania\n\nEkspozycje pozabilansowe\nPL - Linie kredytowe otrzymane\nPG - Gwarancje otrzymane\nPT - Transakcje pozabilansowe","1 - <= 1 D\n2 - > 1 D <= 1 W\n3 - > 1 W <= 1 M\n4 - > 1 M <= 3 M\n5 - > 3 M <= 6 M\n6 - > 6 M <= 1 Y\n7 - > 1 Y <= 5 Y\n8 - > 5 Y","Waluta ","Kwota\n(tys. zł)","Data\n(w formacie liczbowym, nie tekstowym)",null,"Algorytmy kontrolne pola DataTMP\nkolumna 15 (O)\n\nKontrola kompletności danych w poszczególnych dniach miesiąca",null,null,null,null,null,"Algorytmy kontrolne reszty kolumn\n\nWpisy błędne",null,null,null,null,"Algorytmy kontrolne kolumn\n\nWpisy poprawne",null,null,null,null,null,null,"DataTMP czy święto","Nazwa podmiotu","Zapadalność","Kwota","DataTMP","EKZ błąd długości","EKZ - znak 1","EKZ błąd znaków 2- 5","EKZ - błąd znak 6","EKZ - błąd znak 7","EKZ - błąd znaków 8-12","EKZ OK","Pomocni-cza EKZ","EKZ - błąd struktury numeru",null,"Regon błąd długości","Regon - błąd struktury (zawiera litery)","Regon OK","Pomocni-cza Regon"]
[1,{"$f":"A20+1","v":2},3,4,5,6,7,8,9,10,11,12,13,14,15,null,null,null,null,null,null,null,null,null,null,null,null,null,null,null,null,null,null,null,null,{"$f":"SUM(AJ22:AJ500)","v":0},0,0,0,0,0,0,0,0,0,{"$f":"COUNTIF(AT21:AT500,\">1\")","v":0},null,null,null,{"$f":"SUM(AX22:AX500)","v":0},{"$f":"SUM(AY22:AY500)","v":0},{"$f":"COUNTIF(AZ21:AZ500,\">1\")","v":0}]
["Finansowanie","KodBanku","NazwaBanku","Data","Rez/Nierez","KodKraju","NazwaPodmiotu","Regon/EKZ","CzyMatka","Sektor","Ekspozycja","Zapadalność","Waluta","Kwota","DataTMP",null,{"$f":"R16","v":"Wybierz miesiąc"},{"$f":"R15","v":"Wybierz Rok"},null,null,null,null,{"$f":"\"Pole \" & G21 & \" - kolumna G (7)\"","v":"Pole NazwaPodmiotu - kolumna G (7)"},null,null,null,null,"Liczba wpisów Razem",{"$f":"S3","v":0},null,null,null,null,null,null,null,null,null,null,{"$f":"COUNTIF(AN22:AN500,0)","v":0},0,0,0,0,0,0,null,{"$f":"COUNTIF(AV22:AV500,\">0\")","v":0},null,{"$f":"COUNTIF(AX22:AX500,0)","v":0},null,{"$f":"COUNTIF(AZ22:AZ500,0)","v":0}]
[{"$f":"IF(ROW()<$AG$4+$W$5,\"O\",\"\")","v":""},{"$f":"IF(A22<>\"\",IF($G$4=\"\",\"Błąd\",$AC$2),\"\")","v":""},{"$f":"IF(A22<>\"\",IF($G$4=\"\",\"Błąd\",$AC$3),\"\")","v":""},{"$f":"IF(A22<>\"\",IF(OR($S$15=\"Błąd\",$S$16=\"Błąd\",O22=\"\",O22<$AK$2,O22>$AK$3),\"Błąd\",O22),\"\")","v":""},{"$f":"IF(A22<>\"\",IF(AT22=0,\"N\",IF(AZ22=0,\"R\",\"Błąd\")),\"\")","v":""},{"$f":"IF(A22<>\"\",IF(AT22=0,MID(H22,6,2),IF(AZ22=0,\"PL\",\"Błąd\")),\"\")","v":""},null,null,null,null,null,null,null,null,null,null,null,null,null,null,null,null,"Liczba pustych komórek",{"$f":"IF($W$7=\"TAK\",$W$5-S3,0)","v":0},null,null,null,"Liczba wpisów tekstowych",{"$f":"AJ20","v":0},null,"Kod","Nazwa Krótka","Bank",null,{"$f":"IF(AND(O22>=$AK$2,O22<=$AK$3),VLOOKUP(O22,$Q$26:$U$56,5,FALSE),\"\")","v":""},{"$f":"IF(LEN(G22)>0,1,0)","v":0},{"$f":"IF(T(L22)<>\"\",1,0)","v":0},{"$f":"IF(T(N22)<>\"\",1,0)","v":0},{"$f":"IF(T(O22)<>\"\",1,0)","v":0},{"$f":"IF($AO22=0,IF(LEN($H22)<>12,1,0),\"xxx\")","v":"xxx"},{"$f":"IF(LEFT($H22,1)=\"Z\",0,IF($H22=\"\",\"xxx\",1))","v":"xxx"},{"$f":"IF($AO22=0,IF(AND(MID($H22,2,4)<>\"0000\",MID($H22,2,4)<>\"1000\"),1,0),\"xxx\")","v":"xxx"},{"$f":"IF($AO22=0,IF(AND(LEN($H22)>=6,CODE(MID($H22,6,1))>=65,CODE(MID($H22,6,1))<=90),0,1),\"xxx\")","v":"xxx"},{"$f":"IF($AO22=0,IF(AND(LEN($H22)>=7,CODE(MID($H22,7,1))>=65,CODE(MID($H22,7,1))<=90),0,1),\"xxx\")","v":"xxx"},{"$f":"IF($AO22=0,IF(ISNUMBER($AU22),0,1),\"xxx\")","v":"xxx"},{"$f":"IF(COUNTIF(AN22:AR22,\"xxx\")>0,\"xxx\",SUM(AN22:AS22))","v":"xxx"},{"$f":"VALUE(MID($H22,8,5))","v":{"$error":"#VALUE!"}},{"$f":"SUM(AP22:AS22)","v":0},null,{"$f":"IF(AO22=1,IF(LEN($H22)=9,0,1),\"xxx\")","v":"xxx"},{"$f":"IF($AO22=1,IF(ISNUMBER($BA22),0,1),\"xxx\")","v":"xxx"},{"$f":"IF(COUNTIF(AX22:AY22,\"xxx\")>0,\"xxx\",SUM(AX22:AY22))","v":"xxx"},{"$f":"VALUE(H22)","v":0}]
["","","","","","",null,null,null,null,null,null,null,null,null,null,"Daty wcześniejsze",null,null,{"$f":"COUNTIF($O$22:$O$500,\"<\" & $AK$2)","v":0},null,null,"Liczba wpisów liczbowych",{"$f":"COUNT($G$22:$G$500)","v":0},null,null,null,"Razem poprawnych",{"$f":"SUM(AC22)","v":0},null,103,"B. Handlowy",{"$f":"AE23 & \" - \" & AF23","v":"103 - B. Handlowy"},null,"",0,0,0,0,"xxx","xxx","xxx","xxx","xxx","xxx",{"$f":"IF(COUNTIF(AN23:AR23,\"xxx\")>0,\"xxx\",SUM(AN23:AS23))","v":"xxx"},{"$f":"VALUE(MID($H23,8,5))","v":{"$error":"#VALUE!"}},{"$f":"SUM(AP23:AS23)","v":0},null,{"$f":"IF(AO23=1,IF(LEN($H23)=9,0,1),\"xxx\")","v":"xxx"},"xxx",{"$f":"IF(COUNTIF(AX23:AY23,\"xxx\")>0,\"xxx\",SUM(AX23:AY23))","v":"xxx"},0]
["","","","","","",null,null,null,null,null,null,null,null,null,null,null,null,null,null,null,null,"Suma błędów",{"$f":"SUM(X22:X23)","v":0},null,null,null,null,null,null,105,"ING BSK","105 - ING BSK",null,"",0,0,0,0,"xxx","xxx","xxx","xxx","xxx","xxx","xxx",{"$error":"#VALUE!"},0,null,"xxx","xxx","xxx",0,null,"data","miesiąc","wolne"]
["","","","","","",null,null,null,null,null,null,null,null,null,null,"Data","Dzień","Czy święto","Liczba dat","Komunikat",null,null,null,null,null,null,null,null,null,106,"BPH","106 - BPH",null,"",0,0,0,0,"xxx","xxx","xxx","xxx","xxx",{"$f":"IF($AO25=0,IF(ISNUMBER($AU25),0,1),\"xxx\")","v":"xxx"},"xxx",{"$error":"#VALUE!"},0,null,"xxx",{"$f":"IF($AO25=1,IF(ISNUMBER($BA25),0,1),\"xxx\")","v":"xxx"},"xxx",0]
["","","","","","",null,null,null,null,null,null,null,null,null,null,{"$f":"IF(BD26=$AC$6,BC26,\" \")","v":" "},{"$f":"TEXT(Q26,\"dddd\")","v":" "},null,{"$f":"COUNTIF($O$22:$O$500,Q26)","v":0},{"$f":"IF(T26>0,IF(OR(Q26<$AK$2,Q26>$AK$3,BE26=\"wolne\"),\"Błąd\",\"\"),IF(AND(Q26>=$AK$2,Q26<=$AK$3,BE26<>\"wolne\"),\"Brak danych\",\"\"))","v":""},null,{"$f":"\"Pole \" & H21 & \" - kolumna H (8)\"","v":"Pole Regon/EKZ - kolumna H (8)"},null,null,null,null,"Liczba wpisów Razem",{"$f":"S4","v":0},null,109,"BZ WBK","109 - BZ WBK",null,"",0,0,0,0,"xxx","xxx","xxx","xxx","xxx","xxx","xxx",{"$error":"#VALUE!"},0,null,"xxx","xxx","xxx",0,null,{"$f":"$AG$7","v":"Wybierz datę"},{"$f":"IF($AC$15=\"OK\",MONTH(BC26),\"Wybierz datę\")","v":"Wybierz datę"},{"$f":"IFERROR(IF(OR(Q26=\" \",WEEKDAY(BC26,2)=6,WEEKDAY(BC26,2)=7,S26=$S$62),\"wolne\",Q26),\"\")","v":""}]
["","","","","","",null,null,null,null,null,null,null,null,null,null," "," ",null,0,"",null,"Liczba pustych komórek",{"$f":"IF($W$7=\"TAK\",$W$5-S4,0)","v":0},null,null,null,"Liczba wpisów EKZ",{"$f":"AT21","v":0},null,114,"mBank z Oddz.","114 - mBank z Oddz.",null,"",0,0,0,0,"xxx","xxx","xxx","xxx","xxx","xxx","xxx",{"$error":"#VALUE!"},0,null,"xxx","xxx","xxx",0,null,{"$f":"IF($AC$15=\"OK\",BC26+1,\"Wybierz datę\")","v":"Wybierz datę"},"Wybierz datę",""]
["","","","","","",null,null,null,null,null,null,null,null,null,null," "," ",null,0,"",null,"Liczba EKZ o błędnej długości",{"$f":"$AN$20","v":0},null,null,null,"Liczba wpisów Regon",{"$f":"AZ21","v":0},null,116,"Millennium","116 - Millennium",null,"",0,0,0,0,"xxx","xxx","xxx","xxx","xxx","xxx","xxx",{"$error":"#VALUE!"},0,null,"xxx","xxx","xxx",0,null,"Wybierz datę","Wybierz datę",""]
["","","","","","",null,null,null,null,null,null,null,null,null,null," "," ",null,0,"",null,"Liczba EKZ o błędnej strukturze numeru",{"$f":"AV21","v":0},null,null,null,"Razem poprawnych",{"$f":"SUM(AC27:AC28)","v":0},null,128,"HSBC","128 - HSBC",null,"",0,0,0,0,"xxx","xxx","xxx","xxx","xxx","xxx","xxx",{"$error":"#VALUE!"},0,null,"xxx","xxx","xxx",0,null,"Wybierz datę","Wybierz datę",""]
["","","","","","",null,null,null,null,null,null,null,null,null,null," "," ",null,0,"",null,"Liczba Regonów tekstowych o błędnej długości",{"$f":"$AX$20","v":0},null,null,null,null,null,null,147,"Euro Bank","147 - Euro Bank",null,"",0,0,0,0,"xxx","xxx","xxx","xxx","xxx","xxx","xxx",{"$error":"#VALUE!"},0,null,"xxx","xxx","xxx",0,null,"Wybierz datę","Wybierz datę",""]
{"$rows_left_out":470}